{"text_format":"1","workbook":"xlsx","n_sheets":8,"sheets":["初期登録","ソロコン","コンクール","マーチング","吹奏楽の日","アンサンブル","６２万石","略記号"],"not_rendered":{"charts":0,"images":0,"macros":1,"external_links":0,"defined_names":7,"comments":1,"pivot_tables":0},"unopened":[],"bounds":{"document_bytes":16777216,"sheet_cells":100000,"rows_first":2000,"rows_last":500,"rows_between":2000,"halvings":0,"cell_chars":16384,"cell_head_chars":4096},"cells_cut":0,"cells_raw":0,"read":"whole","date_system":"1900"}

{"sheet":"初期登録","index":0,"n_rows":26,"n_cols":25,"rows_kept":26,"cut":false,"hidden":false,"merged":[[17,0,17,19],[18,0,18,19],[14,0,14,19],[15,0,15,19],[16,0,16,19],[10,3,10,10],[9,3,9,19],[5,5,5,6],[8,3,8,5],[8,14,8,15],[10,12,10,19],[0,0,0,19],[5,0,5,1],[8,6,8,8],[5,7,5,9],[6,2,6,19],[7,2,7,19],[5,10,5,11],[5,12,5,13],[5,14,5,19],[8,9,8,13],[8,16,8,19],[6,0,6,1],[1,9,1,10],[7,0,7,1],[8,0,10,1],[5,2,5,4]]}
["宮城県吹奏楽連盟参加申込書システム",null,null,null,null,null,null,null,null,null,null,null,null,null,null,null,null,null,null,null,"****"]
[null,null,null,null,null,null,null,null,"令和",7,null,"年度",null,null,null,null,null,null,null,null,"**"]
[null,null,null,null,null,null,null,null,null,null,null,null,null,null,null,null,null,null,null,null,"***"]
[null,null,"の枠はリストから選んでください",null,null,null,null,null,null,"の枠は入力してください",null,null,null,null,"全ての申込書に反映されます。",null,null,null,null,null,"**"]
[null,null,null,null,null,null,null,null,null,null,null,null,null,null,null,null,null,null,null,null,"**"]
["加盟地区",null,"仙台宮城野･若林",null,null,"加盟部門",null,"中学生",null,null,"団体代表者氏名",null,"校長",null,null,null,null,null,null,null,"**"]
["フリガナ",null,null,null,null,null,null,null,null,null,null,null,null,null,null,null,null,null,null,null,"**"]
["団体名",null,null,null,null,null,null,null,null,null,null,null,null,null,null,null,null,null,null,null,"**"]
["連絡先",null,"〒",null,null,null,"連絡責任者氏名",null,null,null,null,null,null,null,"当日の緊急\n連絡先",null,null,null,null,null,"**"]
[null,null,"住所",null,null,null,null,null,null,null,null,null,null,null,null,null,null,null,null,null,"**"]
{"$rows_left_out":17}
{"sheet":"ソロコン","index":1,"n_rows":117,"n_cols":21,"rows_kept":117,"cut":false,"hidden":false,"merged":[[32,0,32,19],[26,4,26,19],[27,2,27,3],[31,0,31,19],[28,2,28,3],[28,12,28,13],[30,0,30,19],[27,16,27,17],[29,0,29,19],[28,14,28,16],[25,2,26,2],[19,0,19,1],[20,0,20,1],[21,0,28,1],[3,12,3,18],[8,0,8,19],[20,2,20,11],[28,6,28,8],[28,9,28,11],[27,4,27,5],[17,0,17,1],[18,0,18,1],[27,6,27,13],[19,12,20,12],[19,13,20,19],[21,4,21,19],[21,2,22,2],[17,12,18,12],[17,13,18,19],[28,17,28,19],[28,4,28,5],[23,2,24,2],[23,4,23,19],[24,4,24,19],[25,4,25,19],[19,2,19,11],[18,2,18,11],[17,2,17,11],[22,4,22,19],[16,0,16,1],[10,2,10,19],[11,2,11,19],[12,6,12,8],[14,12,14,19],[16,6,16,9],[12,3,12,5],[12,9,12,13],[12,15,12,19],[16,14,16,19],[16,2,16,4],[16,10,16,13],[2,0,2,5],[10,0,10,1],[11,0,11,1],[12,0,14,1],[13,3,13,19],[4,14,4,18],[4,7,4,9],[4,10,4,11],[4,12,4,13],[6,0,6,19]]}
[null,null,null,null,null,null,null,null,null,null,null,null,null,null,null,null,null,null,null,null,"*＊"]
[null,null,null,null,null,null,null,null,null,null,null,null,null,"令和",{"$f":"+初期登録!$J$2","v":7},"年",null,"月",null,"日","*"]
["宮城県吹奏楽連盟会長　様",null,null,null,null,null,null,null,null,null,null,null,null,null,null,null,null,null,null,null,"*"]
[null,null,null,null,null,null,null,null,null,null,null,null,{"$f":"+初期登録!$C$8","v":0}]
[null,null,null,null,null,null,null,"小・中・高\n大・職・一",null,null,"学校長名\n代表者名",null,{"$f":"+初期登録!M6","v":"校長"},null,{"$f":"+初期登録!O6","v":0},null,null,null,null,"印","**"]
[null,null,null,null,null,null,null,null,null,null,null,null,null,null,null,null,null,null,null,null,"*"]
[{"$f":"\"第\"&O2+33&\"回宮城県管打楽器ソロコンテスト\"","v":"第40回宮城県管打楽器ソロコンテスト"},null,null,null,null,null,null,null,null,null,null,null,null,null,null,null,null,null,null,null,"**"]
[]
["参　加　申　込　書",null,null,null,null,null,null,null,null,null,null,null,null,null,null,null,null,null,null,null,"**"]
[null,null,null,null,null,null,null,null,null,null,null,null,null,null,null,null,null,null,null,null,"*"]
{"$rows_left_out":108}
{"sheet":"コンクール","index":2,"n_rows":116,"n_cols":21,"rows_kept":116,"cut":false,"hidden":false,"merged":[[14,11,14,19],[33,0,33,19],[12,3,12,5],[12,6,12,8],[12,9,12,13],[22,2,23,2],[22,4,22,19],[23,4,23,19],[24,2,25,2],[24,4,24,19],[25,4,25,19],[28,12,28,13],[28,14,28,16],[17,0,17,1],[30,0,30,19],[12,15,12,19],[17,13,17,15],[4,14,4,18],[6,0,6,19],[8,0,8,19],[10,2,10,19],[11,0,11,1],[16,12,16,14],[13,3,13,19],[4,12,4,13],[16,8,16,9],[7,2,7,17],[16,18,16,19],[31,0,31,19],[32,0,32,19],[29,0,29,3],[29,4,29,10],[26,11,26,13],[26,2,26,3],[26,4,26,5],[26,7,26,8],[20,0,28,1],[27,7,27,8],[27,16,27,18],[2,0,2,5],[3,0,3,5],[4,7,4,9],[28,2,28,3],[28,4,28,5],[28,6,28,8],[28,9,28,11],[27,2,27,3],[20,2,21,2],[20,4,20,19],[17,16,17,17],[17,18,17,19],[3,12,3,18],[11,2,11,19],[4,10,4,11],[10,0,10,1],[12,0,14,1],[16,2,16,3],[16,4,16,5],[16,6,16,7],[18,0,18,1],[19,0,19,1],[28,17,28,19],[21,4,21,19],[18,2,18,19],[19,2,19,19]]}
[null,null,null,null,null,null,null,null,null,null,null,null,null,null,null,null,null,null,null,null,"*＊"]
[null,null,null,null,null,null,null,null,null,null,null,null,null,"令和",{"$f":"+初期登録!$J$2","v":7},"年",null,"月",null,"日","*"]
["宮城県吹奏楽連盟会長　様",null,null,null,null,null,null,null,null,null,null,null,null,null,null,null,null,null,null,null,"*"]
["予選大会主管地区会長　様",null,null,null,null,null,null,null,null,null,null,null,{"$f":"+初期登録!$C$8","v":0}]
[null,null,null,null,null,null,null,"小・中・高\n大・職・一",null,null,"学校長名\n代表者名",null,{"$f":"+初期登録!M6","v":"校長"},null,{"$f":"+初期登録!O6","v":0},null,null,null,null,"印","**"]
[null,null,null,null,null,null,null,null,null,null,null,null,null,null,null,null,null,null,null,null,"*"]
[{"$f":"\"第\"&O2+61&\"回宮城県吹奏楽コンクール　兼\"","v":"第68回宮城県吹奏楽コンクール　兼"},null,null,null,null,null,null,null,null,null,null,null,null,null,null,null,null,null,null,null,"**"]
[null,null,{"$f":"VLOOKUP(初期登録!C6,初期登録!W15:Y26,3,FALSE)","v":"予選仙台太白・宮城野・若林地区大会"}]
["参加申込書兼参加登録書",null,null,null,null,null,null,null,null,null,null,null,null,null,null,null,null,null,null,null,"**"]
[null,null,null,null,null,null,null,null,null,null,null,null,null,null,null,null,null,null,null,null,"*"]
{"$rows_left_out":107}
{"sheet":"マーチング","index":3,"n_rows":123,"n_cols":21,"rows_kept":123,"cut":false,"hidden":false,"merged":[[7,6,7,14],[7,3,7,5],[40,0,40,19],[12,9,12,13],[12,15,12,19],[33,18,33,19],[32,1,32,8],[32,9,32,12],[32,13,32,16],[31,1,31,8],[31,9,31,12],[31,13,31,16],[36,0,36,19],[37,0,37,19],[18,12,18,13],[29,18,29,19],[31,18,31,19],[32,17,32,19],[33,1,33,8],[33,9,33,12],[33,13,33,16],[28,17,28,19],[30,1,30,8],[30,9,30,12],[30,13,30,16],[29,1,29,8],[29,9,29,12],[29,13,29,16],[30,17,30,19],[28,1,28,8],[28,9,28,12],[28,13,28,16],[27,9,27,12],[27,13,27,16],[24,0,24,1],[16,0,17,1],[25,9,25,12],[25,13,25,16],[25,0,25,8],[11,0,11,1],[12,0,14,1],[18,0,18,1],[21,2,21,19],[22,2,22,19],[13,3,13,19],[11,2,11,19],[12,3,12,5],[12,6,12,8],[35,0,35,19],[38,0,38,19],[39,0,39,19],[19,2,19,19],[20,2,20,19],[19,0,19,1],[20,0,20,1],[21,0,21,1],[22,0,22,1],[25,17,25,19],[34,12,34,13],[34,14,34,16],[34,17,34,19],[34,0,34,1],[34,2,34,3],[34,4,34,6],[34,7,34,9],[6,4,6,18],[26,17,26,19],[27,18,27,19],[26,1,26,8],[27,1,27,8],[26,9,26,12],[26,13,26,16],[6,1,6,3],[14,12,14,19],[10,0,10,1],[8,0,8,19],[10,2,10,19],[23,0,23,1],[23,2,23,19],[24,2,24,19],[2,0,2,5],[4,7,4,9],[4,10,4,11],[4,12,4,13],[3,12,3,18],[4,14,4,18]]}
[null,null,null,null,null,null,null,null,null,null,null,null,null,null,null,null,null,null,null,null,"*＊"]
[null,null,null,null,null,null,null,null,null,null,null,null,null,"令和",{"$f":"+初期登録!$J$2","v":7},"年",null,"月",null,"日","*"]
["宮城県吹奏楽連盟会長　様",null,null,null,null,null,null,null,null,null,null,null,null,null,null,null,null,null,null,null,"*"]
[null,null,null,null,null,null,null,null,null,null,null,null,{"$f":"+初期登録!$C$8","v":0}]
[null,null,null,null,null,null,null,"小・中・高\n大・職・一",null,null,"学校長名\n代表者名",null,{"$f":"+初期登録!M6","v":"校長"},null,{"$f":"+初期登録!O6","v":0},null,null,null,null,"印","**"]
[null,null,null,null,null,null,null,null,null,null,null,null,null,null,null,null,null,null,null,null,"*"]
[null,{"$f":"\"第\"&$O$2+37&\"回\"","v":"第44回"},null,null,"全日本小学生バンドフェスティバル宮城県大会",null,null,null,null,null,null,null,null,null,null,null,null,null,null,null,"**"]
[null,null,null,{"$f":"\"第\"&$O$2+31&\"回\"","v":"第38回"},null,null,"宮城県マーチングコンテスト　　　　",null,null,null,null,null,null,null,null,null,null,null,null,null,"**"]
["参　加　申　込　書",null,null,null,null,null,null,null,null,null,null,null,null,null,null,null,null,null,null,null,"**"]
[null,null,null,null,null,null,null,null,null,null,null,null,null,null,null,null,null,null,null,null,"*"]
{"$rows_left_out":114}
{"sheet":"吹奏楽の日","index":4,"n_rows":106,"n_cols":21,"rows_kept":106,"cut":false,"hidden":false,"merged":[[35,7,35,8],[29,0,35,1],[39,0,39,19],[36,16,36,18],[37,0,37,19],[38,0,38,19],[36,0,36,1],[35,2,35,3],[35,4,35,5],[27,17,27,19],[34,12,34,13],[34,14,34,16],[27,12,27,13],[27,14,27,16],[33,16,33,17],[31,13,31,19],[32,13,32,19],[29,4,29,19],[30,4,30,19],[34,4,34,5],[28,7,28,8],[33,4,33,5],[33,6,33,7],[34,17,34,19],[20,2,20,10],[26,2,26,3],[22,2,23,2],[22,4,22,19],[23,4,23,19],[26,16,26,17],[26,4,26,5],[26,6,26,7],[21,2,21,10],[21,11,21,19],[24,13,24,19],[25,13,25,19],[24,11,25,11],[25,4,25,10],[24,4,24,10],[24,2,25,2],[27,2,27,3],[27,4,27,5],[34,2,34,3],[31,4,31,10],[29,2,30,2],[31,2,32,2],[28,4,28,5],[27,9,27,11],[34,6,34,8],[34,9,34,11],[31,11,32,11],[32,4,32,10],[27,6,27,8],[33,2,33,3],[28,2,28,3],[18,2,18,10],[19,2,19,10],[16,15,16,17],[12,6,12,8],[12,9,12,13],[12,15,12,19],[12,3,12,5],[14,12,14,19],[19,11,19,19],[17,11,17,19],[18,11,18,19],[16,2,16,10],[16,11,16,14],[20,11,20,19],[2,0,2,5],[10,0,10,1],[11,0,11,1],[12,0,14,1],[6,0,6,19],[8,0,8,19],[10,2,10,19],[11,2,11,19],[4,14,4,18],[4,7,4,9],[4,10,4,11],[3,12,3,18],[4,12,4,13],[13,3,13,19],[17,2,17,10],[22,0,28,1],[16,0,16,1],[17,0,19,1],[20,0,20,1],[21,0,21,1]]}
[null,null,null,null,null,null,null,null,null,null,null,null,null,null,null,null,null,null,null,null,"*＊"]
[null,null,null,null,null,null,null,null,null,null,null,null,null,"令和",{"$f":"+初期登録!$J$2","v":7},"年",null,"月",null,"日","*"]
["宮城県吹奏楽連盟会長　様",null,null,null,null,null,null,null,null,null,null,null,null,null,null,null,null,null,null,null,"*"]
[null,null,null,null,null,null,null,null,null,null,null,null,{"$f":"+初期登録!$C$8","v":0}]
[null,null,null,null,null,null,null,"小・中・高\n大・職・一",null,null,"学校長名\n代表者名",null,{"$f":"+初期登録!M6","v":"校長"},null,{"$f":"+初期登録!O6","v":0},null,null,null,null,"印","**"]
[null,null,null,null,null,null,null,null,null,null,null,null,null,null,null,null,null,null,null,null,"*"]
[{"$f":"\"第\"&O2+40&\"回東北吹奏楽の日演奏会\"","v":"第47回東北吹奏楽の日演奏会"},null,null,null,null,null,null,null,null,null,null,null,null,null,null,null,null,null,null,null,"**"]
[]
["参　加　申　込　書",null,null,null,null,null,null,null,null,null,null,null,null,null,null,null,null,null,null,null,"**"]
[null,null,null,null,null,null,null,null,null,null,null,null,null,null,null,null,null,null,null,null,"*"]
{"$rows_left_out":97}
{"sheet":"アンサンブル","index":5,"n_rows":282,"n_cols":27,"rows_kept":282,"cut":false,"hidden":false,"merged":[[180,11,180,19],[182,15,182,17],[190,7,190,9],[106,7,106,9],[107,6,107,8],[107,9,107,11],[107,14,107,16],[115,0,115,19],[116,0,116,19],[117,0,117,19],[118,0,118,19],[126,0,127,6],[127,12,127,18],[93,0,93,1],[93,2,93,19],[94,0,96,1],[95,3,95,19],[96,11,96,19],[98,9,98,10],[98,15,98,17],[98,18,98,19],[104,2,105,2],[104,4,104,19],[105,4,105,19],[86,7,86,9],[86,10,86,11],[86,12,86,13],[86,14,86,18],[88,0,88,19],[89,2,89,17],[90,0,90,19],[92,0,92,1],[92,2,92,19],[73,0,73,19],[74,0,74,19],[75,0,75,19],[84,0,85,6],[85,12,85,18],[66,1,66,2],[66,3,66,7],[66,8,66,9],[66,11,66,12],[66,13,66,17],[66,18,66,19],[72,0,72,19],[56,3,56,10],[56,12,56,19],[57,0,64,1],[57,2,58,2],[57,4,57,19],[59,2,60,2],[61,2,62,2],[63,2,63,3],[63,4,63,5],[63,7,63,9],[63,16,63,17],[64,6,64,8],[64,9,64,11],[64,12,64,13],[64,14,64,16],[64,17,64,19],[52,3,52,19],[53,11,53,19],[55,0,55,1],[55,3,55,4],[55,6,55,7],[55,9,55,10],[55,12,55,13],[55,15,55,17],[55,18,55,19],[41,0,42,6],[42,12,42,18],[43,7,43,9],[43,10,43,11],[43,12,43,13],[43,14,43,18],[45,0,45,19],[46,2,46,17],[47,0,47,19],[7,2,7,17],[16,15,16,17],[14,11,14,19],[2,0,3,6],[202,0,202,19],[157,0,157,19],[158,0,158,19],[159,0,159,19],[160,0,160,19],[174,0,174,19],[170,12,170,13],[170,14,170,18],[169,12,169,18],[170,7,170,9],[170,10,170,11],[172,0,172,19],[168,0,169,6],[173,2,173,17],[178,0,180,1],[179,3,179,19],[176,0,176,1],[176,2,176,19],[141,0,141,1],[141,3,141,10],[141,12,141,19],[146,4,146,19],[152,18,152,19],[153,13,153,17],[153,18,153,19],[154,13,154,17],[154,18,154,19],[155,13,155,17],[155,18,155,19],[154,1,154,2],[154,3,154,7],[155,1,155,2],[155,3,155,7],[155,8,155,9],[155,11,155,12],[154,8,154,9],[140,0,140,1],[142,0,149,1],[149,17,149,19],[148,4,148,5],[149,14,149,16],[148,16,148,17],[149,6,149,8],[149,9,149,11],[149,12,149,13],[140,15,140,17],[140,18,140,19],[148,2,148,3],[148,7,148,9],[30,1,30,2],[34,0,34,19],[31,1,31,2],[35,0,35,19],[36,0,36,19],[31,13,31,17],[31,18,31,19],[33,0,33,19],[31,3,31,7],[31,8,31,9],[31,11,31,12],[182,18,182,19],[140,3,140,4],[140,6,140,7],[140,9,140,10],[140,12,140,13],[182,9,182,10],[182,12,182,13],[147,4,147,19],[98,6,98,7],[98,12,98,13],[70,13,70,17],[70,18,70,19],[107,12,107,13],[110,18,110,19],[111,13,111,17],[111,18,111,19],[112,13,112,17],[112,18,112,19],[62,4,62,19],[56,0,56,1],[8,0,8,19],[6,0,6,19],[4,7,4,9],[4,10,4,11],[4,12,4,13],[4,14,4,18],[30,3,30,7],[30,8,30,9],[30,11,30,12],[30,13,30,17],[3,12,3,18],[27,13,27,17],[29,13,29,17],[28,13,28,17],[28,18,28,19],[25,12,25,13],[12,9,12,13],[12,15,12,19],[25,2,25,3],[25,6,25,8],[25,9,25,11],[24,4,24,5],[20,4,20,19],[21,4,21,19],[16,18,16,19],[22,4,22,19],[24,7,24,9],[30,18,30,19],[29,1,29,2],[29,8,29,9],[25,4,25,5],[20,2,21,2],[12,0,14,1],[11,0,11,1],[17,0,17,1],[23,4,23,19],[28,1,28,2],[28,3,28,7],[28,8,28,9],[28,11,28,12],[22,2,23,2],[29,3,29,7],[16,3,16,4],[16,12,16,13],[17,12,17,19],[18,4,18,19],[19,4,19,19],[17,3,17,10],[16,9,16,10],[27,18,27,19],[29,18,29,19],[10,0,10,1],[27,1,27,2],[27,8,27,9],[27,3,27,7],[18,2,19,2],[13,3,13,19],[18,0,25,1],[16,0,16,1],[29,11,29,12],[27,11,27,12],[24,16,24,17],[25,14,25,16],[25,17,25,19],[12,3,12,5],[12,6,12,8],[10,2,10,19],[11,2,11,19],[24,2,24,3],[16,6,16,7],[50,0,50,1],[50,2,50,19],[49,0,49,1],[49,2,49,19],[51,0,53,1],[51,3,51,5],[51,6,51,8],[51,9,51,13],[51,15,51,19],[98,3,98,4],[94,6,94,8],[94,9,94,13],[58,4,58,19],[59,4,59,19],[60,4,60,19],[61,4,61,19],[64,2,64,3],[64,4,64,5],[70,1,70,2],[70,3,70,7],[70,8,70,9],[70,11,70,12],[94,3,94,5],[67,1,67,2],[67,3,67,7],[67,8,67,9],[67,11,67,12],[67,13,67,17],[67,18,67,19],[68,13,68,17],[68,18,68,19],[69,13,69,17],[69,18,69,19],[69,1,69,2],[69,3,69,7],[69,8,69,9],[69,11,69,12],[68,1,68,2],[68,3,68,7],[68,8,68,9],[68,11,68,12],[94,15,94,19],[107,17,107,19],[109,1,109,2],[109,3,109,7],[109,8,109,9],[109,11,109,12],[109,13,109,17],[109,18,109,19],[107,2,107,3],[107,4,107,5],[100,0,107,1],[100,2,101,2],[100,4,100,19],[101,4,101,19],[102,2,103,2],[102,4,102,19],[103,4,103,19],[106,2,106,3],[106,4,106,5],[99,0,99,1],[99,3,99,10],[99,12,99,19],[106,16,106,17],[98,0,98,1],[111,1,111,2],[111,3,111,7],[111,8,111,9],[111,11,111,12],[110,1,110,2],[110,3,110,7],[110,8,110,9],[110,11,110,12],[110,13,110,17],[113,13,113,17],[113,18,113,19],[112,1,112,2],[112,3,112,7],[113,1,113,2],[113,3,113,7],[113,8,113,9],[113,11,113,12],[112,8,112,9],[112,11,112,12],[128,7,128,9],[128,10,128,11],[137,3,137,19],[130,0,130,19],[132,0,132,19],[134,0,134,1],[134,2,134,19],[128,12,128,13],[128,14,128,18],[135,0,135,1],[135,2,135,19],[136,0,138,1],[131,2,131,17],[138,11,138,19],[152,1,152,2],[152,3,152,7],[152,8,152,9],[152,11,152,12],[136,3,136,5],[136,6,136,8],[136,9,136,13],[136,15,136,19],[151,1,151,2],[151,3,151,7],[151,8,151,9],[151,11,151,12],[151,13,151,17],[151,18,151,19],[149,2,149,3],[149,4,149,5],[142,2,143,2],[142,4,142,19],[143,4,143,19],[144,2,145,2],[144,4,144,19],[145,4,145,19],[146,2,147,2],[152,13,152,17],[177,0,177,1],[177,2,177,19],[189,4,189,19],[183,0,183,1],[183,3,183,10],[183,12,183,19],[188,2,189,2],[188,4,188,19],[182,0,182,1],[182,3,182,4],[182,6,182,7],[178,3,178,5],[178,6,178,8],[178,9,178,13],[186,2,187,2],[186,4,186,19],[187,4,187,19],[178,15,178,19],[154,11,154,12],[153,1,153,2],[153,3,153,7],[153,8,153,9],[153,11,153,12],[194,1,194,2],[194,3,194,7],[194,8,194,9],[194,11,194,12],[194,13,194,17],[194,18,194,19],[195,13,195,17],[195,18,195,19],[184,0,191,1],[184,2,185,2],[184,4,184,19],[191,6,191,8],[191,9,191,11],[190,2,190,3],[190,4,190,5],[191,12,191,13],[191,14,191,16],[191,17,191,19],[193,1,193,2],[193,3,193,7],[193,8,193,9],[193,11,193,12],[193,13,193,17],[197,8,197,9],[197,11,197,12],[196,8,196,9],[196,11,196,12],[190,16,190,17],[185,4,185,19],[199,0,199,19],[200,0,200,19],[201,0,201,19],[196,18,196,19],[197,13,197,17],[197,18,197,19],[196,1,196,2],[196,3,196,7],[197,1,197,2],[197,3,197,7],[196,13,196,17],[193,18,193,19],[191,2,191,3],[191,4,191,5],[195,1,195,2],[195,3,195,7],[195,8,195,9],[195,11,195,12]]}
[null,null,null,null,null,null,null,null,null,null,null,null,null,null,null,null,null,null,null,null,"*＊"]
[null,null,null,null,null,null,null,null,null,null,null,null,null,"令和",{"$f":"+初期登録!$J$2","v":7},"年",null,"月",null,"日","*"]
[{"$f":"\"宮城県吹奏楽連盟会長　様\"&CHAR(10)&初期登録!C6&\"地区会長　様\"","v":"宮城県吹奏楽連盟会長　様\n仙台宮城野･若林地区会長　様"},null,null,null,null,null,null,null,null,null,null,null,null,null,null,null,null,null,null,null,"*"]
[null,null,null,null,null,null,null,null,null,null,null,null,{"$f":"+初期登録!$C$8","v":0}]
[null,null,null,null,null,null,null,"小・中・高\n大・職・一",null,null,"学校長名\n代表者名",null,{"$f":"+初期登録!$M$6","v":"校長"},null,{"$f":"+初期登録!$O$6","v":0},null,null,null,null,"印","**"]
[null,null,null,null,null,null,null,null,null,null,null,null,null,null,null,null,null,null,null,null,"*"]
[{"$f":"\"第\"&$O$2+52&\"回宮城県アンサンブルコンテスト\"&\"　兼\"","v":"第59回宮城県アンサンブルコンテスト　兼"},null,null,null,null,null,null,null,null,null,null,null,null,null,null,null,null,null,null,null,"**"]
[null,null,{"$f":"\"予選\"&+初期登録!$C$6&\"地区大会\"","v":"予選仙台宮城野･若林地区大会"}]
["参　加　申　込　書",null,null,null,null,null,null,null,null,null,null,null,null,null,null,null,null,null,null,null,"**"]
[null,null,null,null,null,null,null,null,null,null,null,null,null,null,null,null,null,null,null,null,"*"]
{"$rows_left_out":273}
{"sheet":"６２万石","index":6,"n_rows":106,"n_cols":21,"rows_kept":106,"cut":false,"hidden":false,"merged":[[26,6,26,7],[33,6,33,7],[37,0,37,19],[38,0,38,19],[39,0,39,19],[34,17,34,19],[35,2,35,3],[35,4,35,5],[35,7,35,8],[29,0,35,1],[29,2,30,2],[29,4,29,19],[33,16,33,17],[36,0,36,1],[36,16,36,18],[34,2,34,3],[34,9,34,11],[34,12,34,13],[34,14,34,16],[31,11,32,11],[34,4,34,5],[34,6,34,8],[31,4,31,10],[33,4,33,5],[32,13,32,19],[31,13,31,19],[28,2,28,3],[28,4,28,5],[28,7,28,8],[31,2,32,2],[33,2,33,3],[32,4,32,10],[27,9,27,11],[27,12,27,13],[27,14,27,16],[27,17,27,19],[30,4,30,19],[22,0,28,1],[22,2,23,2],[22,4,22,19],[23,4,23,19],[24,2,25,2],[24,4,24,10],[24,11,25,11],[24,13,24,19],[25,4,25,10],[25,13,25,19],[26,2,26,3],[26,4,26,5],[26,16,26,17],[27,2,27,3],[27,4,27,5],[27,6,27,8],[20,0,20,1],[20,2,20,10],[20,11,20,19],[21,0,21,1],[21,2,21,10],[21,11,21,19],[16,0,16,1],[16,2,16,10],[16,11,16,14],[16,15,16,17],[17,0,19,1],[17,2,17,10],[17,11,17,19],[18,2,18,10],[18,11,18,19],[19,2,19,10],[19,11,19,19],[12,0,14,1],[12,3,12,5],[12,6,12,8],[12,9,12,13],[12,15,12,19],[13,3,13,19],[14,12,14,19],[6,0,6,19],[8,0,8,19],[10,0,10,1],[10,2,10,19],[11,0,11,1],[11,2,11,19],[2,0,2,5],[3,12,3,18],[4,7,4,9],[4,10,4,11],[4,12,4,13],[4,14,4,18]]}
[null,null,null,null,null,null,null,null,null,null,null,null,null,null,null,null,null,null,null,null,"*＊"]
[null,null,null,null,null,null,null,null,null,null,null,null,null,"令和",{"$f":"+初期登録!$J$2+1","v":8},"年",null,"月",null,"日","*"]
["宮城県吹奏楽連盟会長　様",null,null,null,null,null,null,null,null,null,null,null,null,null,null,null,null,null,null,null,"*"]
[]
[null,null,null,null,null,null,null,"職・一",null,null,"代表者名",null,null,null,{"$f":"+初期登録!O6","v":0},null,null,null,null,"印","**"]
[null,null,null,null,null,null,null,null,null,null,null,null,null,null,null,null,null,null,null,null,"*"]
[{"$f":"\"第\"&O2+4&\"回　６２万石吹奏楽祭\"","v":"第12回　６２万石吹奏楽祭"},null,null,null,null,null,null,null,null,null,null,null,null,null,null,null,null,null,null,null,"**"]
[]
["参　加　申　込　書",null,null,null,null,null,null,null,null,null,null,null,null,null,null,null,null,null,null,null,"**"]
[null,null,null,null,null,null,null,null,null,null,null,null,null,null,null,null,null,null,null,null,"*"]
{"$rows_left_out":97}
{"sheet":"略記号","index":7,"n_rows":38,"n_cols":6,"rows_kept":38,"cut":false,"hidden":false,"merged":[[32,5,32,6],[28,5,28,6],[27,5,27,6],[29,5,29,6],[30,5,30,6],[31,5,31,6],[36,5,36,6],[37,5,37,6],[35,5,35,6],[33,5,33,6],[34,5,34,6],[24,5,24,6],[25,5,25,6],[26,5,26,6],[16,5,16,6],[12,1,12,4],[25,1,25,4],[10,5,10,6],[11,5,11,6],[17,5,17,6],[18,5,18,6],[12,5,12,6],[13,5,13,6],[14,5,14,6],[15,5,15,6],[10,1,10,4],[4,1,4,4],[5,1,5,4],[6,1,6,4],[11,1,11,4],[28,1,28,4],[13,1,13,4],[14,1,14,4],[15,1,15,4],[16,1,16,4],[35,1,35,4],[29,1,29,4],[30,1,30,4],[31,1,31,4],[32,1,32,4],[37,1,37,4],[36,1,36,4],[17,1,17,4],[18,1,18,4],[21,1,21,4],[22,1,22,4],[23,1,23,4],[24,1,24,4],[20,1,20,6],[26,1,26,4],[27,1,27,4],[21,5,21,6],[22,5,22,6],[23,5,23,6],[33,1,33,4],[34,1,34,4],[1,1,1,6],[9,1,9,4],[2,5,2,6],[3,5,3,6],[4,5,4,6],[5,5,5,6],[6,5,6,6],[7,5,7,6],[2,1,2,4],[3,1,3,4],[7,1,7,4],[8,1,8,4],[9,5,9,6],[8,5,8,6]]}
[]
[null,"楽器名略記号"]
[null,"Piccolo",null,null,null,"Picc."]
[null,"Flute",null,null,null,"Fl."]
[null,"Oboe",null,null,null,"Ob."]
[null,"English Horn ",null,null,null,"E.Hrn."]
[null,"Bassoon",null,null,null,"Bn."]
[null,"Contra Bassoons ",null,null,null,"C.Bn."]
[null,"E♭Clarinet",null,null,null,"E.Cl."]
[null,"B♭Clarinet",null,null,null,"Cl."]
{"$rows_left_out":28}